Reaction Details
TargetProtein LANA1
LigandBDBM51046
Substrate/Competitorn/a
Meas. Tech.Fluorescence Polarization Cell-Free Homogeneous Dose Retest to Confirm Inhibitors of the LANA Histone H2A/H2B Interaction
EC50 6462±n/a nM
Citation PubChem, PC Fluorescence Polarization Cell-Free Homogeneous Dose Retest to Confirm Inhibitors of the LANA Histone H2A/H2B Interaction PubChem Bioassay(2010)[AID]
 
Protein LANA1
Name:Protein LANA1
Type:Enzyme Catalytic Domain
Mol. Mass.:131093.36
Organism:Human herpesvirus 8
Description:Q9QR71
Residue:1129
BDBM51046
NameBDBM51046
Synonyms:2-(6-morpholin-4-yl-1,3-dioxobenzo[de]isoquinolin-2-yl)ethyl 3-chlorobenzoate 3-chlorobenzoic acid 2-(1,3-diketo-6-morpholino-benzo[de]isoquinolin-2-yl)ethyl ester MLS000722229 cid_3414919
TypeSmall organic molecule
Emp. Form.C25H21ClN2O5
Mol. Mass.464.898
SMILESClc1cccc(c1)C(=O)OCCN1C(=O)c2cccc3c(ccc(C1=O)c23)N1CCOCC1