Reaction Details
TargetProtein LANA1
LigandBDBM73513
Substrate/Competitorn/a
Meas. Tech.Fluorescence Polarization Cell-Free Homogeneous Dose Retest to Confirm Inhibitors of the LANA Histone H2A/H2B Interaction
EC50 4927±n/a nM
Citation PubChem, PC Fluorescence Polarization Cell-Free Homogeneous Dose Retest to Confirm Inhibitors of the LANA Histone H2A/H2B Interaction PubChem Bioassay(2010)[AID]
 
Protein LANA1
Name:Protein LANA1
Type:Enzyme Catalytic Domain
Mol. Mass.:131093.36
Organism:Human herpesvirus 8
Description:Q9QR71
Residue:1129
BDBM73513
NameBDBM73513
Synonyms:2-[4-[(2-tert-butyl-2-methyl-4,6-dioxo-1,3-dioxan-5-ylidene)methyl]phenoxy]-N-phenylacetamide 2-[4-[[2-tert-butyl-2-methyl-4,6-bis(oxidanylidene)-1,3-dioxan-5-ylidene]methyl]phenoxy]-N-phenyl-ethanamide MLS000702700 cid_985005
TypeSmall organic molecule
Emp. Form.C24H25NO6
Mol. Mass.423.4584
SMILESCC(C)(C)C1(C)OC(=O)C(=Cc2ccc(OCC(=O)Nc3ccccc3)cc2)C(=O)O1