Reaction Details
TargetProtein LANA1
LigandBDBM51078
Substrate/Competitorn/a
Meas. Tech.Fluorescence Polarization Cell-Free Homogeneous Dose Retest to Confirm Inhibitors of the LANA Histone H2A/H2B Interaction
EC50 1425±n/a nM
Citation PubChem, PC Fluorescence Polarization Cell-Free Homogeneous Dose Retest to Confirm Inhibitors of the LANA Histone H2A/H2B Interaction PubChem Bioassay(2010)[AID]
 
Protein LANA1
Name:Protein LANA1
Type:Enzyme Catalytic Domain
Mol. Mass.:131093.36
Organism:Human herpesvirus 8
Description:Q9QR71
Residue:1129
BDBM51078
NameBDBM51078
Synonyms:6-amino-2-(1,3,5-trimethyl-1H-pyrazol-4-yl)-1H-benzo[de]isoquinoline-1,3(2H)-dione 6-amino-2-(1,3,5-trimethylpyrazol-4-yl)benzo[de]isoquinoline-1,3-dione 6-azanyl-2-(1,3,5-trimethylpyrazol-4-yl)benzo[de]isoquinoline-1,3-dione SMR000227538 | cid_839988
TypeSmall organic molecule
Emp. Form.C18H16N4O2
Mol. Mass.320.3452
SMILESCc1nn(C)c(C)c1N1C(=O)c2cccc3c(N)ccc(C1=O)c23