Reaction Details
TargetProtein LANA1
LigandBDBM51151
Substrate/Competitorn/a
Meas. Tech.Fluorescence Polarization Cell-Free Homogeneous Dose Retest to Confirm Inhibitors of the LANA Histone H2A/H2B Interaction
EC50>4600±n/a nM
Citation PubChem, PC Fluorescence Polarization Cell-Free Homogeneous Dose Retest to Confirm Inhibitors of the LANA Histone H2A/H2B Interaction PubChem Bioassay(2010)[AID]
 
Protein LANA1
Name:Protein LANA1
Type:Enzyme Catalytic Domain
Mol. Mass.:131093.36
Organism:Human herpesvirus 8
Description:Q9QR71
Residue:1129
BDBM51151
NameBDBM51151
Synonyms:8-Amino-3-cyclohexyl-10H-benzo[g]pteridine-2,4-dione 8-amino-3-cyclohexyl-1H-benzo[g]pteridine-2,4-quinone MLS000589211 cid_5422824
TypeSmall organic molecule
Emp. Form.C16H17N5O2
Mol. Mass.311.3385
SMILESNc1ccc2nc3c(nc2c1)[nH]c(=O)n(C1CCCCC1)c3=O