Reaction Details
TargetProtein LANA1
LigandBDBM51183
Substrate/Competitorn/a
Meas. Tech.Fluorescence Polarization Cell-Free Homogeneous Dose Retest to Confirm Inhibitors of the LANA Histone H2A/H2B Interaction
EC50 295.2±n/a nM
Citation PubChem, PC Fluorescence Polarization Cell-Free Homogeneous Dose Retest to Confirm Inhibitors of the LANA Histone H2A/H2B Interaction PubChem Bioassay(2010)[AID]
 
Protein LANA1
Name:Protein LANA1
Type:Enzyme Catalytic Domain
Mol. Mass.:131093.36
Organism:Human herpesvirus 8
Description:Q9QR71
Residue:1129
BDBM51183
NameBDBM51183
Synonyms:(6Z)-5-azanylidene-3-(2-methylpropylsulfanyl)-6-[(4-oxidanylidenechromen-3-yl)methylidene]-[1,2,4]thiadiazolo[4,5-a]pyrimidin-7-one (6Z)-5-imino-3-(2-methylpropylthio)-6-[(4-oxo-1-benzopyran-3-yl)methylidene]-[1,2,4]thiadiazolo[4,5-a]pyrimidin-7-one (6Z)-5-imino-3-(isobutylthio)-6-[(4-oxo-4H-chromen-3-yl)methylene]-5,6-dihydro-7H-[1,2,4]thiadiazolo[4,5-a]pyrimidin-7-one SMR000309727 | cid_16193843
TypeSmall organic molecule
Emp. Form.C19H16N4O3S2
Mol. Mass.412.485
SMILESCC(C)CSC1=NSC2=NC(=O)\C(=C/c3coc4ccccc4c3=O)C(=N)N12