Reaction Details
TargetProtein LANA1
LigandBDBM73686
Substrate/Competitorn/a
Meas. Tech.Fluorescence Polarization Cell-Free Homogeneous Dose Retest to Confirm Inhibitors of the LANA Histone H2A/H2B Interaction
EC50 3665±n/a nM
Citation PubChem, PC Fluorescence Polarization Cell-Free Homogeneous Dose Retest to Confirm Inhibitors of the LANA Histone H2A/H2B Interaction PubChem Bioassay(2010)[AID]
 
Protein LANA1
Name:Protein LANA1
Type:Enzyme Catalytic Domain
Mol. Mass.:131093.36
Organism:Human herpesvirus 8
Description:Q9QR71
Residue:1129
BDBM73686
NameBDBM73686
Synonyms:MLS000694819 N-cyano-4-(2-pyridyl)piperazine-1-carboximidothioic acid methyl ester cid_1482472 methyl N-cyano-4-pyridin-2-yl-piperazine-1-carboximidothioate | methyl N-cyano-4-pyridin-2-ylpiperazine-1-carboximidothioate
TypeSmall organic molecule
Emp. Form.C12H15N5S
Mol. Mass.261.346
SMILESCS\C(=N/C#N)N1CCN(CC1)c1ccccn1