Reaction Details
TargetProtein LANA1
LigandBDBM73688
Substrate/Competitorn/a
Meas. Tech.Fluorescence Polarization Cell-Free Homogeneous Dose Retest to Confirm Inhibitors of the LANA Histone H2A/H2B Interaction
EC50 152±n/a nM
Citation PubChem, PC Fluorescence Polarization Cell-Free Homogeneous Dose Retest to Confirm Inhibitors of the LANA Histone H2A/H2B Interaction PubChem Bioassay(2010)[AID]
 
Protein LANA1
Name:Protein LANA1
Type:Enzyme Catalytic Domain
Mol. Mass.:131093.36
Organism:Human herpesvirus 8
Description:Q9QR71
Residue:1129
BDBM73688
NameBDBM73688
Synonyms:1-(2-pyridin-2-yl-1,3-thiazol-5-yl)ethanone 1-[2-(2-pyridinyl)-5-thiazolyl]ethanone MLS000720508 cid_2768203
TypeSmall organic molecule
Emp. Form.C10H8N2OS
Mol. Mass.204.248
SMILESCC(=O)c1cnc(s1)-c1ccccn1