Reaction Details
TargetProtein LANA1
LigandBDBM51223
Substrate/Competitorn/a
Meas. Tech.Fluorescence Polarization Cell-Free Homogeneous Dose Retest to Confirm Inhibitors of the LANA Histone H2A/H2B Interaction
EC50 5033±n/a nM
Citation PubChem, PC Fluorescence Polarization Cell-Free Homogeneous Dose Retest to Confirm Inhibitors of the LANA Histone H2A/H2B Interaction PubChem Bioassay(2010)[AID]
 
Protein LANA1
Name:Protein LANA1
Type:Enzyme Catalytic Domain
Mol. Mass.:131093.36
Organism:Human herpesvirus 8
Description:Q9QR71
Residue:1129
BDBM51223
NameBDBM51223
Synonyms:(2,4-dihydroxyphenyl)-phenyl-methanone MLS000774789 [2,4-bis(oxidanyl)phenyl]-phenyl-methanone hsp90_163
TypeSmall organic molecule
Emp. Form.C13H10O3
Mol. Mass.214.2167
SMILESOc1ccc(C(=O)c2ccccc2)c(O)c1