Reaction Details
TargetProtein LANA1
LigandBDBM66121
Substrate/Competitorn/a
Meas. Tech.Fluorescence Polarization Cell-Free Homogeneous Dose Retest to Confirm Inhibitors of the LANA Histone H2A/H2B Interaction
EC50 63.8±n/a nM
Citation PubChem, PC Fluorescence Polarization Cell-Free Homogeneous Dose Retest to Confirm Inhibitors of the LANA Histone H2A/H2B Interaction PubChem Bioassay(2010)[AID]
 
Protein LANA1
Name:Protein LANA1
Type:Enzyme Catalytic Domain
Mol. Mass.:131093.36
Organism:Human herpesvirus 8
Description:Q9QR71
Residue:1129
BDBM66121
NameBDBM66121
Synonyms:(2E)-2-(dimethylaminomethylene)pyrrol[1,2-a]indole-1,4-quinone 2-[1-Dimethylamino-meth-(E)-ylidene]-2H-pyrrolo[1,2-a]indole-3,9-dione SMR000425528 | cid_776411
TypeSmall organic molecule
Emp. Form.C14H12N2O2
Mol. Mass.240.2573
SMILESCN(C)\C=C1/C=C2N(C1=O)c1ccccc1C2=O