Reaction Details
TargetProtein LANA1
LigandBDBM52845
Substrate/Competitorn/a
Meas. Tech.Fluorescence Polarization Cell-Free Homogeneous Dose Retest to Confirm Inhibitors of the LANA Histone H2A/H2B Interaction
EC50 5838±n/a nM
Citation PubChem, PC Fluorescence Polarization Cell-Free Homogeneous Dose Retest to Confirm Inhibitors of the LANA Histone H2A/H2B Interaction PubChem Bioassay(2010)[AID]
 
Protein LANA1
Name:Protein LANA1
Type:Enzyme Catalytic Domain
Mol. Mass.:131093.36
Organism:Human herpesvirus 8
Description:Q9QR71
Residue:1129
BDBM52845
NameBDBM52845
Synonyms:(3Z)-3-[2-keto-2-(p-tolyl)ethylidene]-6-methyl-4H-1,4-benzoxazin-2-one (3Z)-6-methyl-3-[2-(4-methylphenyl)-2-oxoethylidene]-4H-1,4-benzoxazin-2-one MLS000768944 cid_5587444
TypeSmall organic molecule
Emp. Form.C18H15NO3
Mol. Mass.293.3166
SMILESCc1ccc(cc1)C(=O)Cc1nc2cc(C)ccc2oc1=O