Reaction Details
TargetProtein LANA1
LigandBDBM73789
Substrate/Competitorn/a
Meas. Tech.Fluorescence Polarization Cell-Free Homogeneous Dose Retest to Confirm Inhibitors of the LANA Histone H2A/H2B Interaction
EC50 2709±n/a nM
Citation PubChem, PC Fluorescence Polarization Cell-Free Homogeneous Dose Retest to Confirm Inhibitors of the LANA Histone H2A/H2B Interaction PubChem Bioassay(2010)[AID]
 
Protein LANA1
Name:Protein LANA1
Type:Enzyme Catalytic Domain
Mol. Mass.:131093.36
Organism:Human herpesvirus 8
Description:Q9QR71
Residue:1129
BDBM73789
NameBDBM73789
Synonyms:8-amino-3-benzyl-7-methyl-1H-benzo[g]pteridine-2,4-dione 8-amino-7-methyl-3-(phenylmethyl)-1H-benzo[g]pteridine-2,4-dione MLS000768803 cid_5400997
TypeSmall organic molecule
Emp. Form.C18H15N5O2
Mol. Mass.333.344
SMILESCc1cc2nc3c(nc2cc1N)[nH]c(=O)n(Cc1ccccc1)c3=O