Reaction Details
TargetProtein LANA1
LigandBDBM51281
Substrate/Competitorn/a
Meas. Tech.Fluorescence Polarization Cell-Free Homogeneous Dose Retest to Confirm Inhibitors of the LANA Histone H2A/H2B Interaction
EC50 1620±n/a nM
Citation PubChem, PC Fluorescence Polarization Cell-Free Homogeneous Dose Retest to Confirm Inhibitors of the LANA Histone H2A/H2B Interaction PubChem Bioassay(2010)[AID]
 
Protein LANA1
Name:Protein LANA1
Type:Enzyme Catalytic Domain
Mol. Mass.:131093.36
Organism:Human herpesvirus 8
Description:Q9QR71
Residue:1129
BDBM51281
NameBDBM51281
Synonyms:6-Amino-2-(1,3-dimethyl-1H-pyrazol-4-yl)-benzo[de]isoquinoline-1,3-dione 6-amino-2-(1,3-dimethylpyrazol-4-yl)benzo[de]isoquinoline-1,3-dione 6-azanyl-2-(1,3-dimethylpyrazol-4-yl)benzo[de]isoquinoline-1,3-dione SMR000426873 | cid_910931
TypeSmall organic molecule
Emp. Form.C17H14N4O2
Mol. Mass.306.3187
SMILESCc1nn(C)cc1N1C(=O)c2cccc3c(N)ccc(C1=O)c23