Reaction Details
TargetProtein LANA1
LigandBDBM66129
Substrate/Competitorn/a
Meas. Tech.Fluorescence Polarization Cell-Free Homogeneous Dose Retest to Confirm Inhibitors of the LANA Histone H2A/H2B Interaction
EC50 6193±n/a nM
Citation PubChem, PC Fluorescence Polarization Cell-Free Homogeneous Dose Retest to Confirm Inhibitors of the LANA Histone H2A/H2B Interaction PubChem Bioassay(2010)[AID]
 
Protein LANA1
Name:Protein LANA1
Type:Enzyme Catalytic Domain
Mol. Mass.:131093.36
Organism:Human herpesvirus 8
Description:Q9QR71
Residue:1129
BDBM66129
NameBDBM66129
Synonyms:2-(3-aminophenyl)-6-azanyl-benzo[de]isoquinoline-1,3-dione 6-amino-2-(3-aminophenyl)benzo[de]isoquinoline-1,3-dione MLS001213036 cid_832817
TypeSmall organic molecule
Emp. Form.C18H13N3O2
Mol. Mass.303.3147
SMILESNc1cccc(c1)N1C(=O)c2cccc3c(N)ccc(C1=O)c23