Reaction Details
TargetProtein LANA1
LigandBDBM53129
Substrate/Competitorn/a
Meas. Tech.Fluorescence Polarization Cell-Free Homogeneous Dose Retest to Confirm Inhibitors of the LANA Histone H2A/H2B Interaction
EC50>4600±n/a nM
Citation PubChem, PC Fluorescence Polarization Cell-Free Homogeneous Dose Retest to Confirm Inhibitors of the LANA Histone H2A/H2B Interaction PubChem Bioassay(2010)[AID]
 
Protein LANA1
Name:Protein LANA1
Type:Enzyme Catalytic Domain
Mol. Mass.:131093.36
Organism:Human herpesvirus 8
Description:Q9QR71
Residue:1129
BDBM53129
NameBDBM53129
Synonyms:6-Amino-2-methyl-benzo[de]isoquinoline-1,3-dione 6-amino-2-methylbenzo[de]isoquinoline-1,3-dione MLS001212981 cid_3091494
TypeSmall organic molecule
Emp. Form.C13H10N2O2
Mol. Mass.226.2307
SMILESCN1C(=O)c2cccc3c(N)ccc(C1=O)c23