Reaction Details
TargetProtein LANA1
LigandBDBM73914
Substrate/Competitorn/a
Meas. Tech.Fluorescence Polarization Cell-Free Homogeneous Dose Retest to Confirm Inhibitors of the LANA Histone H2A/H2B Interaction
EC50 5049±n/a nM
Citation PubChem, PC Fluorescence Polarization Cell-Free Homogeneous Dose Retest to Confirm Inhibitors of the LANA Histone H2A/H2B Interaction PubChem Bioassay(2010)[AID]
 
Protein LANA1
Name:Protein LANA1
Type:Enzyme Catalytic Domain
Mol. Mass.:131093.36
Organism:Human herpesvirus 8
Description:Q9QR71
Residue:1129
BDBM73914
NameBDBM73914
Synonyms:6-methoxy-2,3-dihydrophenalen-1-one SMR000567823 | cid_2825911
TypeSmall organic molecule
Emp. Form.C14H12O2
Mol. Mass.212.2439
SMILESCOc1ccc2CCC(=O)c3cccc1c23