Reaction Details
TargetProtein LANA1
LigandBDBM74055
Substrate/Competitorn/a
Meas. Tech.Fluorescence Polarization Cell-Free Homogeneous Dose Retest to Confirm Inhibitors of the LANA Histone H2A/H2B Interaction
EC50 1115±n/a nM
Citation PubChem, PC Fluorescence Polarization Cell-Free Homogeneous Dose Retest to Confirm Inhibitors of the LANA Histone H2A/H2B Interaction PubChem Bioassay(2010)[AID]
 
Protein LANA1
Name:Protein LANA1
Type:Enzyme Catalytic Domain
Mol. Mass.:131093.36
Organism:Human herpesvirus 8
Description:Q9QR71
Residue:1129
BDBM74055
NameBDBM74055
Synonyms:MLS001115286 N-(3,5-dimethylphenyl)-1,3,3-trimethyl-2-oxo-5-indolesulfonamide N-(3,5-dimethylphenyl)-2-keto-1,3,3-trimethyl-indoline-5-sulfonamide cid_22518799
TypeSmall organic molecule
Emp. Form.C19H22N2O3S
Mol. Mass.358.455
SMILESCN1C(=O)C(C)(C)c2cc(ccc12)S(=O)(=O)Nc1cc(C)cc(C)c1