Reaction Details
TargetProtein LANA1
LigandBDBM74215
Substrate/Competitorn/a
Meas. Tech.Fluorescence Polarization Cell-Free Homogeneous Dose Retest to Confirm Inhibitors of the LANA Histone H2A/H2B Interaction
EC50 285.4±n/a nM
Citation PubChem, PC Fluorescence Polarization Cell-Free Homogeneous Dose Retest to Confirm Inhibitors of the LANA Histone H2A/H2B Interaction PubChem Bioassay(2010)[AID]
 
Protein LANA1
Name:Protein LANA1
Type:Enzyme Catalytic Domain
Mol. Mass.:131093.36
Organism:Human herpesvirus 8
Description:Q9QR71
Residue:1129
BDBM74215
NameBDBM74215
Synonyms:1-(2-methyl-2,3-dihydroindol-1-yl)-2-(2-pyrimidinylthio)ethanone 1-(2-methyl-2,3-dihydroindol-1-yl)-2-pyrimidin-2-ylsulfanylethanone MLS001098209 cid_16488278
TypeSmall organic molecule
Emp. Form.C15H15N3OS
Mol. Mass.285.364
SMILESCC1Cc2ccccc2N1C(=O)CSc1ncccn1