Reaction Details
TargetProtein LANA1
LigandBDBM74252
Substrate/Competitorn/a
Meas. Tech.Fluorescence Polarization Cell-Free Homogeneous Dose Retest to Confirm Inhibitors of the LANA Histone H2A/H2B Interaction
EC50 385±n/a nM
Citation PubChem, PC Fluorescence Polarization Cell-Free Homogeneous Dose Retest to Confirm Inhibitors of the LANA Histone H2A/H2B Interaction PubChem Bioassay(2010)[AID]
 
Protein LANA1
Name:Protein LANA1
Type:Enzyme Catalytic Domain
Mol. Mass.:131093.36
Organism:Human herpesvirus 8
Description:Q9QR71
Residue:1129
BDBM74252
NameBDBM74252
Synonyms:1-[2,2-bis(chloranyl)-1-(4-ethylphenyl)ethyl]-4-ethyl-benzene 1-[2,2-dichloro-1-(4-ethylphenyl)ethyl]-4-ethylbenzene MLS002152919 cid_6295
TypeSmall organic molecule
Emp. Form.C18H20Cl2
Mol. Mass.307.257
SMILESCCc1ccc(cc1)C(C(Cl)Cl)c1ccc(CC)cc1