Reaction Details
TargetProtein LANA1
LigandBDBM60980
Substrate/Competitorn/a
Meas. Tech.Fluorescence Polarization Cell-Free Homogeneous Dose Retest to Confirm Inhibitors of the LANA Histone H2A/H2B Interaction
EC50 2372±n/a nM
Citation PubChem, PC Fluorescence Polarization Cell-Free Homogeneous Dose Retest to Confirm Inhibitors of the LANA Histone H2A/H2B Interaction PubChem Bioassay(2010)[AID]
 
Protein LANA1
Name:Protein LANA1
Type:Enzyme Catalytic Domain
Mol. Mass.:131093.36
Organism:Human herpesvirus 8
Description:Q9QR71
Residue:1129
BDBM60980
NameBDBM60980
Synonyms:1-methyl-2,3,4,9-tetrahydro-beta-carbolin-7-one;hydrate;hydrochloride Harmalol hydrochloride dihydrate SMR001233258 | cid_16667410
TypeSmall organic molecule
Emp. Form.C12H12N2O
Mol. Mass.200.2365
SMILESCC1=C2N=c3cc(O)ccc3=C2CCN1