Reaction Details
TargetProtein LANA1
LigandBDBM74287
Substrate/Competitorn/a
Meas. Tech.Fluorescence Polarization Cell-Free Homogeneous Dose Retest to Confirm Inhibitors of the LANA Histone H2A/H2B Interaction
EC50>75000±n/a nM
Citation PubChem, PC Fluorescence Polarization Cell-Free Homogeneous Dose Retest to Confirm Inhibitors of the LANA Histone H2A/H2B Interaction PubChem Bioassay(2010)[AID]
 
Protein LANA1
Name:Protein LANA1
Type:Enzyme Catalytic Domain
Mol. Mass.:131093.36
Organism:Human herpesvirus 8
Description:Q9QR71
Residue:1129
BDBM74287
NameBDBM74287
Synonyms:MLS002180217 N'-(4-chlorobenzoyl)-7a-methyl-5-oxo-2,3,6,7-tetrahydropyrrolo[2,1-b][1,3]thiazole-3-carbohydrazide N'-[(4-chlorophenyl)-oxomethyl]-7a-methyl-5-oxo-2,3,6,7-tetrahydropyrrolo[2,1-b]thiazole-3-carbohydrazide cid_25162061
TypeSmall organic molecule
Emp. Form.C15H16ClN3O3S
Mol. Mass.353.824
SMILESCC12CCC(=O)N1C(CS2)C(=O)NNC(=O)c1ccc(Cl)cc1