Reaction Details
TargetProtein LANA1
LigandBDBM74292
Substrate/Competitorn/a
Meas. Tech.Fluorescence Polarization Cell-Free Homogeneous Dose Retest to Confirm Inhibitors of the LANA Histone H2A/H2B Interaction
EC50>75000±n/a nM
Citation PubChem, PC Fluorescence Polarization Cell-Free Homogeneous Dose Retest to Confirm Inhibitors of the LANA Histone H2A/H2B Interaction PubChem Bioassay(2010)[AID]
 
Protein LANA1
Name:Protein LANA1
Type:Enzyme Catalytic Domain
Mol. Mass.:131093.36
Organism:Human herpesvirus 8
Description:Q9QR71
Residue:1129
BDBM74292
NameBDBM74292
Synonyms:MLS002181699 N-[2-(3-methylphenoxy)phenyl]-2,3-dihydro-1,4-dioxine-5-carboxamide SMR001270729 | cid_25162234
TypeSmall organic molecule
Emp. Form.C18H17NO4
Mol. Mass.311.3319
SMILESCc1cccc(Oc2ccccc2NC(=O)C2=COCCO2)c1