Reaction Details
TargetProtein LANA1
LigandBDBM74307
Substrate/Competitorn/a
Meas. Tech.Fluorescence Polarization Cell-Free Homogeneous Dose Retest to Confirm Inhibitors of the LANA Histone H2A/H2B Interaction
EC50>75000±n/a nM
Citation PubChem, PC Fluorescence Polarization Cell-Free Homogeneous Dose Retest to Confirm Inhibitors of the LANA Histone H2A/H2B Interaction PubChem Bioassay(2010)[AID]
 
Protein LANA1
Name:Protein LANA1
Type:Enzyme Catalytic Domain
Mol. Mass.:131093.36
Organism:Human herpesvirus 8
Description:Q9QR71
Residue:1129
BDBM74307
NameBDBM74307
Synonyms:2-[[5-(2-furyl)-4-methyl-1,2,4-triazol-3-yl]thio]-N-(1-keto-4,5-dimethyl-2H-furo[3,4-d]pyridazin-7-yl)acetamide N-(4,5-dimethyl-1-oxidanylidene-2H-furo[3,4-d]pyridazin-7-yl)-2-[[5-(furan-2-yl)-4-methyl-1,2,4-triazol-3-yl]sulfanyl]ethanamide N-(4,5-dimethyl-1-oxo-2H-furo[3,4-d]pyridazin-7-yl)-2-[[5-(furan-2-yl)-4-methyl-1,2,4-triazol-3-yl]sulfanyl]acetamide cid_25162760
TypeSmall organic molecule
Emp. Form.C17H16N6O4S
Mol. Mass.400.412
SMILESCc1oc(NC(=O)CSc2nnc(-c3ccco3)n2C)c2c1c(C)n[nH]c2=O