Reaction Details
TargetProtein LANA1
LigandBDBM74308
Substrate/Competitorn/a
Meas. Tech.Fluorescence Polarization Cell-Free Homogeneous Dose Retest to Confirm Inhibitors of the LANA Histone H2A/H2B Interaction
EC50>75000±n/a nM
Citation PubChem, PC Fluorescence Polarization Cell-Free Homogeneous Dose Retest to Confirm Inhibitors of the LANA Histone H2A/H2B Interaction PubChem Bioassay(2010)[AID]
 
Protein LANA1
Name:Protein LANA1
Type:Enzyme Catalytic Domain
Mol. Mass.:131093.36
Organism:Human herpesvirus 8
Description:Q9QR71
Residue:1129
BDBM74308
NameBDBM74308
Synonyms:4-[(3-nitrophenyl)sulfonylamino]-N-(4-oxidanylcyclohexyl)benzamide N-(4-hydroxycyclohexyl)-4-[(3-nitrophenyl)sulfonylamino]benzamide cid_25162777
TypeSmall organic molecule
Emp. Form.C19H21N3O6S
Mol. Mass.419.452
SMILESOC1CCC(CC1)NC(=O)c1ccc(NS(=O)(=O)c2cccc(c2)[N+]([O-])=O)cc1