Reaction Details
TargetProtein LANA1
LigandBDBM74321
Substrate/Competitorn/a
Meas. Tech.Fluorescence Polarization Cell-Free Homogeneous Dose Retest to Confirm Inhibitors of the LANA Histone H2A/H2B Interaction
EC50>75000±n/a nM
Citation PubChem, PC Fluorescence Polarization Cell-Free Homogeneous Dose Retest to Confirm Inhibitors of the LANA Histone H2A/H2B Interaction PubChem Bioassay(2010)[AID]
 
Protein LANA1
Name:Protein LANA1
Type:Enzyme Catalytic Domain
Mol. Mass.:131093.36
Organism:Human herpesvirus 8
Description:Q9QR71
Residue:1129
BDBM74321
NameBDBM74321
Synonyms:2-[[1,1-bis(oxidanylidene)-1,2-benzothiazol-3-yl]-methyl-amino]-N-(4-chlorophenyl)ethanamide N-(4-chlorophenyl)-2-[(1,1-diketo-1,2-benzothiazol-3-yl)-methyl-amino]acetamide SMR001238977 | cid_9068739
TypeSmall organic molecule
Emp. Form.C16H14ClN3O3S
Mol. Mass.363.819
SMILESCN(CC(=O)Nc1ccc(Cl)cc1)C1=NS(=O)(=O)c2ccccc12