Reaction Details
TargetProtein LANA1
LigandBDBM74322
Substrate/Competitorn/a
Meas. Tech.Fluorescence Polarization Cell-Free Homogeneous Dose Retest to Confirm Inhibitors of the LANA Histone H2A/H2B Interaction
EC50>75000±n/a nM
Citation PubChem, PC Fluorescence Polarization Cell-Free Homogeneous Dose Retest to Confirm Inhibitors of the LANA Histone H2A/H2B Interaction PubChem Bioassay(2010)[AID]
 
Protein LANA1
Name:Protein LANA1
Type:Enzyme Catalytic Domain
Mol. Mass.:131093.36
Organism:Human herpesvirus 8
Description:Q9QR71
Residue:1129
BDBM74322
NameBDBM74322
Synonyms:(3-acetylphenyl) 2,2-dioxo-3,4-dihydropyrido[2,1-c][1,2,4]thiadiazine-9-carboxylate 2,2-diketo-3,4-dihydropyrido[2,1-c][1,2,4]thiadiazine-9-carboxylic acid (3-acetylphenyl) ester MLS002169252 cid_9119549
TypeSmall organic molecule
Emp. Form.C16H14N2O5S
Mol. Mass.346.358
SMILESCC(=O)c1cccc(OC(=O)C2=C3NS(=O)(=O)C=CN3C=CC2)c1