Reaction Details
TargetProtein LANA1
LigandBDBM74326
Substrate/Competitorn/a
Meas. Tech.Fluorescence Polarization Cell-Free Homogeneous Dose Retest to Confirm Inhibitors of the LANA Histone H2A/H2B Interaction
EC50>75000±n/a nM
Citation PubChem, PC Fluorescence Polarization Cell-Free Homogeneous Dose Retest to Confirm Inhibitors of the LANA Histone H2A/H2B Interaction PubChem Bioassay(2010)[AID]
 
Protein LANA1
Name:Protein LANA1
Type:Enzyme Catalytic Domain
Mol. Mass.:131093.36
Organism:Human herpesvirus 8
Description:Q9QR71
Residue:1129
BDBM74326
NameBDBM74326
Synonyms:3,4,5-trimethoxy-N-(2-morpholin-4-yl-1,3-benzothiazol-6-yl)benzamide 3,4,5-trimethoxy-N-[2-(4-morpholinyl)-1,3-benzothiazol-6-yl]benzamide SMR001246046 | cid_16297219
TypeSmall organic molecule
Emp. Form.C21H23N3O5S
Mol. Mass.429.489
SMILESCOc1cc(cc(OC)c1OC)C(=O)Nc1ccc2nc(sc2c1)N1CCOCC1