Reaction Details
TargetProtein LANA1
LigandBDBM74350
Substrate/Competitorn/a
Meas. Tech.Fluorescence Polarization Cell-Free Homogeneous Dose Retest to Confirm Inhibitors of the LANA Histone H2A/H2B Interaction
EC50 1723±n/a nM
Citation PubChem, PC Fluorescence Polarization Cell-Free Homogeneous Dose Retest to Confirm Inhibitors of the LANA Histone H2A/H2B Interaction PubChem Bioassay(2010)[AID]
 
Protein LANA1
Name:Protein LANA1
Type:Enzyme Catalytic Domain
Mol. Mass.:131093.36
Organism:Human herpesvirus 8
Description:Q9QR71
Residue:1129
BDBM74350
NameBDBM74350
Synonyms:MLS001360432 [6-amino-9-(2-carbomethoxyphenyl)xanthen-3-ylidene]ammonium;chloride;hydrate [6-amino-9-(2-methoxycarbonylphenyl)xanthen-3-ylidene]azanium;chloride;hydrate cid_24207752
TypeSmall organic molecule
Emp. Form.C21H17N2O3
Mol. Mass.345.3707
SMILESCOC(=O)c1ccccc1-c1c2ccc(N)cc2oc2cc(=[NH2+])ccc12