Reaction Details
TargetTyrosine-protein phosphatase non-receptor type 22
LigandBDBM74448
Substrate/Competitorn/a
Meas. Tech.Dose Response confirmation of uHTS hits from a small molecule inhibitors of LYP via a fluorescence intensity assay - Set 2
IC50>79400±0 nM
Citation PubChem, PC Dose Response confirmation of uHTS hits from a small molecule inhibitors of LYP via a fluorescence intensity assay - Set 2 PubChem Bioassay(2010)[AID]
 
Tyrosine-protein phosphatase non-receptor type 22
Name:Tyrosine-protein phosphatase non-receptor type 22
Type:n/a
Mol. Mass.:91712.31
Organism:Homo sapiens (Human)
Description:Q9Y2R2
Residue:807
BDBM74448
NameBDBM74448
Synonyms:4-[4-(4-Chloro-benzenesulfonyl)-2-isobutyl-oxazol-5-yl]-morpholine 4-[4-(4-chlorophenyl)sulfonyl-2-(2-methylpropyl)-5-oxazolyl]morpholine MLS000071591 cid_654847
TypeSmall organic molecule
Emp. Form.C17H21ClN2O4S
Mol. Mass.384.878
SMILESCC(C)Cc1nc(c(o1)N1CCOCC1)S(=O)(=O)c1ccc(Cl)cc1