Reaction Details
TargetTyrosine-protein phosphatase non-receptor type 22
LigandBDBM37040
Substrate/Competitorn/a
Meas. Tech.Dose Response confirmation of uHTS hits from a small molecule inhibitors of LYP via a fluorescence intensity assay - Set 2
IC50>79400±0 nM
Citation PubChem, PC Dose Response confirmation of uHTS hits from a small molecule inhibitors of LYP via a fluorescence intensity assay - Set 2 PubChem Bioassay(2010)[AID]
 
Tyrosine-protein phosphatase non-receptor type 22
Name:Tyrosine-protein phosphatase non-receptor type 22
Type:n/a
Mol. Mass.:91712.31
Organism:Homo sapiens (Human)
Description:Q9Y2R2
Residue:807
BDBM37040
NameBDBM37040
Synonyms:3-chloranyl-N-(5-chloranylpyridin-2-yl)-4-ethoxy-benzamide 3-chloro-N-(5-chloro-2-pyridyl)-4-ethoxy-benzamide MLS000089749 cid_3237354
TypeSmall organic molecule
Emp. Form.C14H12Cl2N2O2
Mol. Mass.311.163
SMILESCCOc1ccc(cc1Cl)C(=O)Nc1ccc(Cl)cn1