Reaction Details
TargetTyrosine-protein phosphatase non-receptor type 22
LigandBDBM74462
Substrate/Competitorn/a
Meas. Tech.Dose Response confirmation of uHTS hits from a small molecule inhibitors of LYP via a fluorescence intensity assay - Set 2
IC50>79400±0 nM
Citation PubChem, PC Dose Response confirmation of uHTS hits from a small molecule inhibitors of LYP via a fluorescence intensity assay - Set 2 PubChem Bioassay(2010)[AID]
 
Tyrosine-protein phosphatase non-receptor type 22
Name:Tyrosine-protein phosphatase non-receptor type 22
Type:n/a
Mol. Mass.:91712.31
Organism:Homo sapiens (Human)
Description:Q9Y2R2
Residue:807
BDBM74462
NameBDBM74462
Synonyms:2-morpholinoethyl-(2-phenyl-4-tosyl-oxazol-5-yl)amine 4-(4-methylphenyl)sulfonyl-N-[2-(4-morpholinyl)ethyl]-2-phenyl-5-oxazolamine MLS000051119 cid_1244626
TypeSmall organic molecule
Emp. Form.C22H25N3O4S
Mol. Mass.427.517
SMILESCc1ccc(cc1)S(=O)(=O)c1nc(oc1NCCN1CCOCC1)-c1ccccc1