Reaction Details
TargetTyrosine-protein phosphatase non-receptor type 22
LigandBDBM33642
Substrate/Competitorn/a
Meas. Tech.Dose Response confirmation of uHTS hits from a small molecule inhibitors of LYP via a fluorescence intensity assay - Set 2
IC50>79400±0 nM
Citation PubChem, PC Dose Response confirmation of uHTS hits from a small molecule inhibitors of LYP via a fluorescence intensity assay - Set 2 PubChem Bioassay(2010)[AID]
 
Tyrosine-protein phosphatase non-receptor type 22
Name:Tyrosine-protein phosphatase non-receptor type 22
Type:n/a
Mol. Mass.:91712.31
Organism:Homo sapiens (Human)
Description:Q9Y2R2
Residue:807
BDBM33642
NameBDBM33642
Synonyms:MLS000527911 [3-(4-Chloro-phenyl)-5-methylsulfanyl-[1,2,4]triazol-1-yl]-furan-2-yl-methanone [3-(4-chlorophenyl)-5-(methylthio)-1,2,4-triazol-1-yl]-(2-furyl)methanone cid_828535
TypeSmall organic molecule
Emp. Form.C14H10ClN3O2S
Mol. Mass.319.766
SMILESCSc1nc(nn1C(=O)c1ccco1)-c1ccc(Cl)cc1