Reaction Details
TargetTyrosine-protein phosphatase non-receptor type 22
LigandBDBM51766
Substrate/Competitorn/a
Meas. Tech.Dose Response confirmation of uHTS hits from a small molecule inhibitors of LYP via a fluorescence intensity assay - Set 2
IC50 13108±646 nM
Citation PubChem, PC Dose Response confirmation of uHTS hits from a small molecule inhibitors of LYP via a fluorescence intensity assay - Set 2 PubChem Bioassay(2010)[AID]
 
Tyrosine-protein phosphatase non-receptor type 22
Name:Tyrosine-protein phosphatase non-receptor type 22
Type:n/a
Mol. Mass.:91712.31
Organism:Homo sapiens (Human)
Description:Q9Y2R2
Residue:807
BDBM51766
NameBDBM51766
Synonyms:MLS000696984 N'-[(E)-(5-methoxy-6-oxo-1-cyclohexa-2,4-dienylidene)methyl]-5-nitro-1-benzothiophene-2-carbohydrazide N'-[(E)-(6-keto-5-methoxy-cyclohexa-2,4-dien-1-ylidene)methyl]-5-nitro-benzothiophene-2-carbohydrazide cid_5811720
TypeSmall organic molecule
Emp. Form.C17H13N3O5S
Mol. Mass.371.367
SMILESCOc1ccc[c-](\C=[NH+]\NC(=O)c2cc3cc(ccc3s2)[N+]([O-])=O)c1=O