Reaction Details
TargetImportin subunit alpha-1
LigandBDBM74544
Substrate/Competitorn/a
Meas. Tech.Fluorescence Cell-Free Homogeneous Counterscreen to Identify Inhibitors of the RanGTP-Importin-beta complex.
EC50 5279±n/a nM
Citation PubChem, PC Fluorescence Cell-Free Homogeneous Counterscreen to Identify Inhibitors of the RanGTP-Importin-beta complex. PubChem Bioassay(2010)[AID]
 
Importin subunit alpha-1
Name:Importin subunit alpha-1
Type:Enzyme Catalytic Domain
Mol. Mass.:57852.15
Organism:Homo sapiens (Human)
Description:gi_119609447
Residue:529
BDBM74544
NameBDBM74544
Synonyms:7,8-dimethyl-2-(1-pyrrolidinyl)-3-quinolinecarbonitrile 7,8-dimethyl-2-pyrrolidin-1-ylquinoline-3-carbonitrile MLS000073919 cid_645132
TypeSmall organic molecule
Emp. Form.C16H17N3
Mol. Mass.251.3263
SMILESCc1ccc2cc(C#N)c(nc2c1C)N1CCCC1