Reaction Details
TargetImportin subunit alpha-1
LigandBDBM32136
Substrate/Competitorn/a
Meas. Tech.Fluorescence Cell-Free Homogeneous Counterscreen to Identify Inhibitors of the RanGTP-Importin-beta complex.
EC50 44800±n/a nM
Citation PubChem, PC Fluorescence Cell-Free Homogeneous Counterscreen to Identify Inhibitors of the RanGTP-Importin-beta complex. PubChem Bioassay(2010)[AID]
 
Importin subunit alpha-1
Name:Importin subunit alpha-1
Type:Enzyme Catalytic Domain
Mol. Mass.:57852.15
Organism:Homo sapiens (Human)
Description:gi_119609447
Residue:529
BDBM32136
NameBDBM32136
Synonyms:(7-acetyloxy-4-methyl-2-oxidanylidene-chromen-6-yl) ethanoate MLS000105868 acetic acid (7-acetoxy-2-keto-4-methyl-chromen-6-yl) ester cid_148769
TypeSmall organic molecule
Emp. Form.C14H12O6
Mol. Mass.276.2415
SMILESCC(=O)Oc1cc2oc(=O)cc(C)c2cc1OC(C)=O