Reaction Details
TargetImportin subunit alpha-1
LigandBDBM74787
Substrate/Competitorn/a
Meas. Tech.Fluorescence Cell-Free Homogeneous Counterscreen to Identify Inhibitors of the RanGTP-Importin-beta complex.
EC50 2038±n/a nM
Citation PubChem, PC Fluorescence Cell-Free Homogeneous Counterscreen to Identify Inhibitors of the RanGTP-Importin-beta complex. PubChem Bioassay(2010)[AID]
 
Importin subunit alpha-1
Name:Importin subunit alpha-1
Type:Enzyme Catalytic Domain
Mol. Mass.:57852.15
Organism:Homo sapiens (Human)
Description:gi_119609447
Residue:529
BDBM74787
NameBDBM74787
Synonyms:MLS000555563 N-[2-(2-amino-3-cyano-1-pyrrolo[3,2-b]quinoxalinyl)ethyl]-4-chlorobenzamide N-[2-(2-amino-3-cyanopyrrolo[3,2-b]quinoxalin-1-yl)ethyl]-4-chlorobenzamide SMR000147280 | cid_1921160
TypeSmall organic molecule
Emp. Form.C20H15ClN6O
Mol. Mass.390.826
SMILESNc1c(C#N)c2nc3ccccc3nc2n1CCNC(=O)c1ccc(Cl)cc1