Reaction Details
TargetImportin subunit alpha-1
LigandBDBM74996
Substrate/Competitorn/a
Meas. Tech.Fluorescence Cell-Free Homogeneous Counterscreen to Identify Inhibitors of the RanGTP-Importin-beta complex.
EC50>500000±n/a nM
Citation PubChem, PC Fluorescence Cell-Free Homogeneous Counterscreen to Identify Inhibitors of the RanGTP-Importin-beta complex. PubChem Bioassay(2010)[AID]
 
Importin subunit alpha-1
Name:Importin subunit alpha-1
Type:Enzyme Catalytic Domain
Mol. Mass.:57852.15
Organism:Homo sapiens (Human)
Description:gi_119609447
Residue:529
BDBM74996
NameBDBM74996
Synonyms:1-{[(2,6-dimethylphenyl)amino]carbonyl}-3-oxo-2-(thien-2-ylmethyl)-1,2,3,4-tetrahydropyrido[1,2-a]pyrazin-5-ium N-(2,6-dimethylphenyl)-3-keto-2-(2-thenyl)-1,4-dihydropyrido[1,2-a]pyrazin-5-ium-1-carboxamide;iodide N-(2,6-dimethylphenyl)-3-oxo-2-(thiophen-2-ylmethyl)-1,4-dihydropyrido[1,2-a]pyrazin-5-ium-1-carboxamide;iodide cid_16193763
TypeSmall organic molecule
Emp. Form.C22H22N3O2S
Mol. Mass.392.493
SMILESCc1cccc(C)c1NC(=O)C1N(Cc2cccs2)C(=O)C[n+]2ccccc12