Reaction Details
TargetImportin subunit alpha-1
LigandBDBM51188
Substrate/Competitorn/a
Meas. Tech.Fluorescence Cell-Free Homogeneous Counterscreen to Identify Inhibitors of the RanGTP-Importin-beta complex.
EC50>500000±n/a nM
Citation PubChem, PC Fluorescence Cell-Free Homogeneous Counterscreen to Identify Inhibitors of the RanGTP-Importin-beta complex. PubChem Bioassay(2010)[AID]
 
Importin subunit alpha-1
Name:Importin subunit alpha-1
Type:Enzyme Catalytic Domain
Mol. Mass.:57852.15
Organism:Homo sapiens (Human)
Description:gi_119609447
Residue:529
BDBM51188
NameBDBM51188
Synonyms:(6E)-4-(2-chlorobenzyl)-6-[(3,4-dimethoxyanilino)methylene]-2-nitro-cyclohexa-2,4-dien-1-one (6E)-4-[(2-chlorophenyl)methyl]-6-[(3,4-dimethoxyanilino)methylidene]-2-nitrocyclohexa-2,4-dien-1-one 4-(2-chlorobenzyl)-2-{(E)-[(3,4-dimethoxyphenyl)imino]methyl}-6-nitrophenol SMR000312542 | cid_16194520
TypeSmall organic molecule
Emp. Form.C22H19ClN2O5
Mol. Mass.426.85
SMILESCOc1ccc(cc1OC)\[NH+]=C\c1c[c-](Cc2ccccc2Cl)cc([N+]([O-])=O)c1=O