Reaction Details
TargetImportin subunit alpha-1
LigandBDBM75012
Substrate/Competitorn/a
Meas. Tech.Fluorescence Cell-Free Homogeneous Counterscreen to Identify Inhibitors of the RanGTP-Importin-beta complex.
EC50>500000±n/a nM
Citation PubChem, PC Fluorescence Cell-Free Homogeneous Counterscreen to Identify Inhibitors of the RanGTP-Importin-beta complex. PubChem Bioassay(2010)[AID]
 
Importin subunit alpha-1
Name:Importin subunit alpha-1
Type:Enzyme Catalytic Domain
Mol. Mass.:57852.15
Organism:Homo sapiens (Human)
Description:gi_119609447
Residue:529
BDBM75012
NameBDBM75012
Synonyms:5-[2-(2-ethyl-1-piperidinyl)-2-oxoethoxy]-2-methyl-3,4-dihydroisoquinolin-1-one 5-[2-(2-ethylpiperidin-1-yl)-2-oxoethoxy]-2-methyl-3,4-dihydroisoquinolin-1-one MLS000685865 cid_3638908
TypeSmall organic molecule
Emp. Form.C19H26N2O3
Mol. Mass.330.4213
SMILESCCC1CCCCN1C(=O)COc1cccc2C(=O)N(C)CCc12