Reaction Details
TargetImportin subunit alpha-1
LigandBDBM75026
Substrate/Competitorn/a
Meas. Tech.Fluorescence Cell-Free Homogeneous Counterscreen to Identify Inhibitors of the RanGTP-Importin-beta complex.
EC50 8572±n/a nM
Citation PubChem, PC Fluorescence Cell-Free Homogeneous Counterscreen to Identify Inhibitors of the RanGTP-Importin-beta complex. PubChem Bioassay(2010)[AID]
 
Importin subunit alpha-1
Name:Importin subunit alpha-1
Type:Enzyme Catalytic Domain
Mol. Mass.:57852.15
Organism:Homo sapiens (Human)
Description:gi_119609447
Residue:529
BDBM75026
NameBDBM75026
Synonyms:1-(3-{[4-(4-fluorophenyl)piperazin-1-yl]methyl}-4-methoxyphenyl)-2,3,4,9-tetrahydro-1H-beta-carboline-3-carboxylic acid 1-[3-[[4-(4-fluorophenyl)piperazin-1-yl]methyl]-4-methoxy-phenyl]-2,3,4,9-tetrahydro-1H-pyrido[3,4-b]indole-3-carboxylic acid 1-[3-[[4-(4-fluorophenyl)piperazino]methyl]-4-methoxy-phenyl]-2,3,4,9-tetrahydro-1H-beta-carboline-3-carboxylic acid SMR000339885 | cid_4559992
TypeSmall organic molecule
Emp. Form.C30H31FN4O3
Mol. Mass.514.5905
SMILESCOc1ccc(cc1CN1CCN(CC1)c1ccc(F)cc1)C1NC(Cc2c1[nH]c1ccccc21)C(O)=O