Reaction Details
TargetImportin subunit alpha-1
LigandBDBM75033
Substrate/Competitorn/a
Meas. Tech.Fluorescence Cell-Free Homogeneous Counterscreen to Identify Inhibitors of the RanGTP-Importin-beta complex.
EC50>500000±n/a nM
Citation PubChem, PC Fluorescence Cell-Free Homogeneous Counterscreen to Identify Inhibitors of the RanGTP-Importin-beta complex. PubChem Bioassay(2010)[AID]
 
Importin subunit alpha-1
Name:Importin subunit alpha-1
Type:Enzyme Catalytic Domain
Mol. Mass.:57852.15
Organism:Homo sapiens (Human)
Description:gi_119609447
Residue:529
BDBM75033
NameBDBM75033
Synonyms:5-({[(1-methyl-1H-tetrazol-5-yl)thio]acetyl}amino)-2-phenyl-2H-1,2,3-triazole-4-carboxamide 5-[[2-(1-methyltetrazol-5-yl)sulfanylacetyl]amino]-2-phenyltriazole-4-carboxamide 5-[[2-[(1-methyltetrazol-5-yl)thio]acetyl]amino]-2-phenyl-triazole-4-carboxamide SMR000307089 | cid_4530719
TypeSmall organic molecule
Emp. Form.C13H13N9O2S
Mol. Mass.359.366
SMILESCn1nnnc1SCC(=O)Nc1nn(nc1C(N)=O)-c1ccccc1