Reaction Details
TargetImportin subunit alpha-1
LigandBDBM75073
Substrate/Competitorn/a
Meas. Tech.Fluorescence Cell-Free Homogeneous Counterscreen to Identify Inhibitors of the RanGTP-Importin-beta complex.
EC50>500000±n/a nM
Citation PubChem, PC Fluorescence Cell-Free Homogeneous Counterscreen to Identify Inhibitors of the RanGTP-Importin-beta complex. PubChem Bioassay(2010)[AID]
 
Importin subunit alpha-1
Name:Importin subunit alpha-1
Type:Enzyme Catalytic Domain
Mol. Mass.:57852.15
Organism:Homo sapiens (Human)
Description:gi_119609447
Residue:529
BDBM75073
NameBDBM75073
Synonyms:2-amino-5-keto-1-(4-methoxyphenyl)-2-pyrroline-3-carbonitrile 5-azanyl-1-(4-methoxyphenyl)-2-oxidanylidene-3H-pyrrole-4-carbonitrile SMR000375724 | cid_3843866
TypeSmall organic molecule
Emp. Form.C12H11N3O2
Mol. Mass.229.2346
SMILESCOc1ccc(cc1)N1C(=O)CC(C#N)C1=N