Reaction Details
TargetImportin subunit alpha-1
LigandBDBM75075
Substrate/Competitorn/a
Meas. Tech.Fluorescence Cell-Free Homogeneous Counterscreen to Identify Inhibitors of the RanGTP-Importin-beta complex.
EC50 54210±n/a nM
Citation PubChem, PC Fluorescence Cell-Free Homogeneous Counterscreen to Identify Inhibitors of the RanGTP-Importin-beta complex. PubChem Bioassay(2010)[AID]
 
Importin subunit alpha-1
Name:Importin subunit alpha-1
Type:Enzyme Catalytic Domain
Mol. Mass.:57852.15
Organism:Homo sapiens (Human)
Description:gi_119609447
Residue:529
BDBM75075
NameBDBM75075
Synonyms:MLS001004634 N'-(1,3-dimethyl-2,4-dioxopteridin-6-yl)-4-nitrobenzohydrazide N'-[1,3-dimethyl-2,4-bis(oxidanylidene)pteridin-6-yl]-4-nitro-benzohydrazide cid_4199276
TypeSmall organic molecule
Emp. Form.C15H13N7O5
Mol. Mass.371.3076
SMILESCn1c2ncc(NNC(=O)c3ccc(cc3)[N+]([O-])=O)nc2c(=O)n(C)c1=O