Reaction Details
TargetImportin subunit alpha-1
LigandBDBM75076
Substrate/Competitorn/a
Meas. Tech.Fluorescence Cell-Free Homogeneous Counterscreen to Identify Inhibitors of the RanGTP-Importin-beta complex.
EC50>500000±n/a nM
Citation PubChem, PC Fluorescence Cell-Free Homogeneous Counterscreen to Identify Inhibitors of the RanGTP-Importin-beta complex. PubChem Bioassay(2010)[AID]
 
Importin subunit alpha-1
Name:Importin subunit alpha-1
Type:Enzyme Catalytic Domain
Mol. Mass.:57852.15
Organism:Homo sapiens (Human)
Description:gi_119609447
Residue:529
BDBM75076
NameBDBM75076
Synonyms:2-(3-pyridyl)-N-(2-thiazolin-2-yl)cinchoninamide;hydrochloride N-(4,5-dihydro-1,3-thiazol-2-yl)-2-pyridin-3-yl-quinoline-4-carboxamide;hydrochloride N-(4,5-dihydrothiazol-2-yl)-2-(3-pyridinyl)-4-quinolinecarboxamide;hydrochloride cid_16196953
TypeSmall organic molecule
Emp. Form.C18H14N4OS
Mol. Mass.334.395
SMILESO=C(NC1=NCCS1)c1cc(nc2ccccc12)-c1cccnc1