Reaction Details
TargetImportin subunit alpha-1
LigandBDBM75080
Substrate/Competitorn/a
Meas. Tech.Fluorescence Cell-Free Homogeneous Counterscreen to Identify Inhibitors of the RanGTP-Importin-beta complex.
EC50 12450±n/a nM
Citation PubChem, PC Fluorescence Cell-Free Homogeneous Counterscreen to Identify Inhibitors of the RanGTP-Importin-beta complex. PubChem Bioassay(2010)[AID]
 
Importin subunit alpha-1
Name:Importin subunit alpha-1
Type:Enzyme Catalytic Domain
Mol. Mass.:57852.15
Organism:Homo sapiens (Human)
Description:gi_119609447
Residue:529
BDBM75080
NameBDBM75080
Synonyms:(Z)-4-(4-cyanophenyl)-2-keto-3-(2-quinolyl)but-3-enoic acid (Z)-4-(4-cyanophenyl)-2-oxo-3-(2-quinolinyl)-3-butenoic acid MLS001033775 cid_6043656
TypeSmall organic molecule
Emp. Form.C20H12N2O3
Mol. Mass.328.3209
SMILESOC(=O)C(=O)C(=C/c1ccc(cc1)C#N)\c1ccc2ccccc2n1