Reaction Details
TargetImportin subunit alpha-1
LigandBDBM75096
Substrate/Competitorn/a
Meas. Tech.Fluorescence Cell-Free Homogeneous Counterscreen to Identify Inhibitors of the RanGTP-Importin-beta complex.
EC50 6376±n/a nM
Citation PubChem, PC Fluorescence Cell-Free Homogeneous Counterscreen to Identify Inhibitors of the RanGTP-Importin-beta complex. PubChem Bioassay(2010)[AID]
 
Importin subunit alpha-1
Name:Importin subunit alpha-1
Type:Enzyme Catalytic Domain
Mol. Mass.:57852.15
Organism:Homo sapiens (Human)
Description:gi_119609447
Residue:529
BDBM75096
NameBDBM75096
Synonyms:(E)-2-Cyano-3-(5-dimethylamino-furan-2-yl)-N-isopropyl-acrylamide (E)-2-cyano-3-[5-(dimethylamino)-2-furyl]-N-isopropyl-acrylamide (E)-2-cyano-3-[5-(dimethylamino)furan-2-yl]-N-propan-2-ylprop-2-enamide SMR000437759 | cid_798423
TypeSmall organic molecule
Emp. Form.C13H17N3O2
Mol. Mass.247.293
SMILESCC(C)NC(=O)C(=C\c1ccc(o1)N(C)C)\C#N