Reaction Details
TargetImportin subunit alpha-1
LigandBDBM75102
Substrate/Competitorn/a
Meas. Tech.Fluorescence Cell-Free Homogeneous Counterscreen to Identify Inhibitors of the RanGTP-Importin-beta complex.
EC50 14390±n/a nM
Citation PubChem, PC Fluorescence Cell-Free Homogeneous Counterscreen to Identify Inhibitors of the RanGTP-Importin-beta complex. PubChem Bioassay(2010)[AID]
 
Importin subunit alpha-1
Name:Importin subunit alpha-1
Type:Enzyme Catalytic Domain
Mol. Mass.:57852.15
Organism:Homo sapiens (Human)
Description:gi_119609447
Residue:529
BDBM75102
NameBDBM75102
Synonyms:Acridin-9-yl-[2-(3,4-dimethoxy-phenyl)-ethyl]-amine N-[2-(3,4-dimethoxyphenyl)ethyl]-9-acridinamine;hydrochloride SMR000431551 cid_16682491
TypeSmall organic molecule
Emp. Form.C23H22N2O2
Mol. Mass.358.433
SMILESCOc1ccc(CCNc2c3ccccc3nc3ccccc23)cc1OC