Reaction Details
TargetImportin subunit alpha-1
LigandBDBM52844
Substrate/Competitorn/a
Meas. Tech.Fluorescence Cell-Free Homogeneous Counterscreen to Identify Inhibitors of the RanGTP-Importin-beta complex.
EC50>500000±n/a nM
Citation PubChem, PC Fluorescence Cell-Free Homogeneous Counterscreen to Identify Inhibitors of the RanGTP-Importin-beta complex. PubChem Bioassay(2010)[AID]
 
Importin subunit alpha-1
Name:Importin subunit alpha-1
Type:Enzyme Catalytic Domain
Mol. Mass.:57852.15
Organism:Homo sapiens (Human)
Description:gi_119609447
Residue:529
BDBM52844
NameBDBM52844
Synonyms:4-[(5,6-dioxo-3-pyridinyl)hydrazo]benzenesulfonamide 4-[2-[5,6-bis(oxidanylidene)pyridin-3-yl]hydrazinyl]benzenesulfonamide MLS000738238 cid_5382140
TypeSmall organic molecule
Emp. Form.C11H10N4O4S
Mol. Mass.294.287
SMILESNS(=O)(=O)c1ccc(cc1)N=Nc1c[nH]c(=O)c(O)c1