Reaction Details
TargetTyrosine-protein phosphatase non-receptor type 22
LigandBDBM74447
Substrate/Competitorn/a
Meas. Tech.Dose Response confirmation of uHTS hits from a small molecule inhibitors of LYP via a fluorescence intensity assay using pCAP substrate
IC50>79400±n/a nM
Citation PubChem, PC Dose Response confirmation of uHTS hits from a small molecule inhibitors of LYP via a fluorescence intensity assay using pCAP substrate PubChem Bioassay(2010)[AID]
 
Tyrosine-protein phosphatase non-receptor type 22
Name:Tyrosine-protein phosphatase non-receptor type 22
Type:n/a
Mol. Mass.:91712.31
Organism:Homo sapiens (Human)
Description:Q9Y2R2
Residue:807
BDBM74447
NameBDBM74447
Synonyms:4-(3-Chloro-4-pentyloxy-benzyl)-morpholine 4-[(3-chloranyl-4-pentoxy-phenyl)methyl]morpholine;hydrochloride MLS000031305 cid_6602656
TypeSmall organic molecule
Emp. Form.C16H24ClNO2
Mol. Mass.297.82
SMILESCCCCCOc1ccc(CN2CCOCC2)cc1Cl