Reaction Details
TargetTyrosine-protein phosphatase non-receptor type 22
LigandBDBM74449
Substrate/Competitorn/a
Meas. Tech.Dose Response confirmation of uHTS hits from a small molecule inhibitors of LYP via a fluorescence intensity assay using pCAP substrate
IC50>79400±n/a nM
Citation PubChem, PC Dose Response confirmation of uHTS hits from a small molecule inhibitors of LYP via a fluorescence intensity assay using pCAP substrate PubChem Bioassay(2010)[AID]
 
Tyrosine-protein phosphatase non-receptor type 22
Name:Tyrosine-protein phosphatase non-receptor type 22
Type:n/a
Mol. Mass.:91712.31
Organism:Homo sapiens (Human)
Description:Q9Y2R2
Residue:807
BDBM74449
NameBDBM74449
Synonyms:8-bromanyl-4-piperidin-1-yl-pyrimido[4,5-b][1,4]benzoxazepine 8-bromo-4-piperidin-1-ylpyrimido[4,5-b][1,4]benzoxazepine MLS000079250 cid_658364
TypeSmall organic molecule
Emp. Form.C16H15BrN4O
Mol. Mass.359.22
SMILESBrc1ccc2Oc3ncnc(N4CCCCC4)c3N=Cc2c1