Reaction Details
TargetTyrosine-protein phosphatase non-receptor type 22
LigandBDBM74452
Substrate/Competitorn/a
Meas. Tech.Dose Response confirmation of uHTS hits from a small molecule inhibitors of LYP via a fluorescence intensity assay using pCAP substrate
IC50>79400±n/a nM
Citation PubChem, PC Dose Response confirmation of uHTS hits from a small molecule inhibitors of LYP via a fluorescence intensity assay using pCAP substrate PubChem Bioassay(2010)[AID]
 
Tyrosine-protein phosphatase non-receptor type 22
Name:Tyrosine-protein phosphatase non-receptor type 22
Type:n/a
Mol. Mass.:91712.31
Organism:Homo sapiens (Human)
Description:Q9Y2R2
Residue:807
BDBM74452
NameBDBM74452
Synonyms:MLS000042727 N-(3-acetylphenyl)-2-[[3-(methylthio)-1,2,4-thiadiazol-5-yl]thio]acetamide SMR000048698 | cid_667304
TypeSmall organic molecule
Emp. Form.C13H13N3O2S3
Mol. Mass.339.456
SMILESCSc1nsc(SCC(=O)Nc2cccc(c2)C(C)=O)n1